BDBM50304232 6,7-Dimethoxy-2-[4-(piperidin-1-ylmethyl)-phenyl]-chroman-4-one::CHEMBL608396
SMILES COc1cc2OC(CC(=O)c2cc1OC)c1ccc(cc1)N1CCCCC1
InChI Key InChIKey=BCARUKUOTJIFBF-UHFFFAOYSA-N
Data  2 IC50
  Tab Delimited (TSV)   2D SDfile   Computed 3D by Vconf -m prep SDfile
Find this compound or compounds like it in BindingDB:
Activity Spreadsheet -- Enzyme Inhibition Constant Data from BindingDB
Found 2 hits for monomerid = 50304232
TargetCarboxylic ester hydrolase(Rattus norvegicus (rat))
Zhejiang University
Curated by ChEMBL
LigandPNGBDBM50304232(6,7-Dimethoxy-2-[4-(piperidin-1-ylmethyl)-phenyl]-...)
Affinity DataIC50:  4.80E+4nM. Assay description: Inhibition of BChE in rat serum after 15 mins by modified Ellman's method
In DepthDetails ArticlePubMed
TargetAcetylcholinesterase(Rattus norvegicus (rat))
Zhejiang University
Curated by ChEMBL
LigandPNGBDBM50304232(6,7-Dimethoxy-2-[4-(piperidin-1-ylmethyl)-phenyl]-...)
Affinity DataIC50:  248nM. Assay description: Inhibition of AChE in rat cortex after 15 mins by modified Ellman's method
In DepthDetails ArticlePubMed