BDBM50304250 6,7-Dimethoxy-3-[4-(piperidin-1-ylmethyl)-phenyl]-4Hchroman-4-one::CHEMBL595130
SMILES COc1cc2occ(-c3ccc(cc3)N3CCCCC3)c(=O)c2cc1OC
InChI Key InChIKey=SPFRZWSEBSDBQB-UHFFFAOYSA-N
Data  2 IC50
  Tab Delimited (TSV)   2D SDfile   Computed 3D by Vconf -m prep SDfile
Find this compound or compounds like it in BindingDB:
Activity Spreadsheet -- Enzyme Inhibition Constant Data from BindingDB
Found 2 hits for monomerid = 50304250
TargetAcetylcholinesterase(Rattus norvegicus (rat))
Zhejiang University
Curated by ChEMBL
LigandPNGBDBM50304250(6,7-Dimethoxy-3-[4-(piperidin-1-ylmethyl)-phenyl]-...)
Affinity DataIC50:  68nM. Assay description: Inhibition of AChE in rat cortex after 15 mins by modified Ellman's method
In DepthDetails ArticlePubMed
TargetCarboxylic ester hydrolase(Rattus norvegicus (rat))
Zhejiang University
Curated by ChEMBL
LigandPNGBDBM50304250(6,7-Dimethoxy-3-[4-(piperidin-1-ylmethyl)-phenyl]-...)
Affinity DataIC50: >1.00E+5nM. Assay description: Inhibition of BChE in rat serum after 15 mins by modified Ellman's method
In DepthDetails ArticlePubMed