BDBM50304329 13-Ethylidene-11-methyl-1-[2-methyl-3-phenyl-prop-2-enylideneamino]-6-aza-tricyclo[7.3.1.0*2,7*]trideca-2(7),3,10-trien-5-one::CHEMBL594187
SMILES C\C=C1/[C@@H]2Cc3[nH]c(=O)ccc3[C@]1(CC(C)=C2)\N=C\C(\C)=C\c1ccccc1
InChI Key InChIKey=UPNJKBJOFORQKA-ZAKCZKPSSA-N
Data  2 IC50
  Tab Delimited (TSV)   2D SDfile   Computed 3D by Vconf -m prep SDfile
Find this compound or compounds like it in BindingDB:
Activity Spreadsheet -- Enzyme Inhibition Constant Data from BindingDB
Found 2 hits for monomerid = 50304329
TargetAcetylcholinesterase(Homo sapiens (Human))
The Chinese Academy Of Sciences
Curated by ChEMBL
LigandPNGBDBM50304329(13-Ethylidene-11-methyl-1-[2-methyl-3-phenyl-prop-...)
Affinity DataIC50:  25nM. Assay description: Inhibition of human AChE by Ellman's method
In DepthDetails ArticlePubMed
TargetAcetylcholinesterase(Tetronarce californica (Pacific electric ray) (Tor...)
The Chinese Academy Of Sciences
Curated by ChEMBL
LigandPNGBDBM50304329(13-Ethylidene-11-methyl-1-[2-methyl-3-phenyl-prop-...)
Affinity DataIC50:  1.63nM. Assay description: Inhibition of Torpedo california AChE by Ellman's method
In DepthDetails ArticlePubMed