BDBM50304436 7-(3,5-Difluorobenzyl)-N-(4-morpholin-4-ylphenyl)-7Hpyrrolo[2,3-d]pyrimidin-2-amine::CHEMBL596223
SMILES Fc1cc(F)cc(Cn2ccc3cnc(Nc4ccc(cc4)N4CCOCC4)nc23)c1
InChI Key InChIKey=BKXBJRBGRSFVLX-UHFFFAOYSA-N
Data  1 IC50
  Tab Delimited (TSV)   2D SDfile   Computed 3D by Vconf -m prep SDfile
Find this compound or compounds like it in BindingDB:
Activity Spreadsheet -- Enzyme Inhibition Constant Data from BindingDB
Found 1 hit for monomerid = 50304436
TargetSignal transducer and activator of transcription 6(Homo sapiens (Human))
Astellas Pharma
Curated by ChEMBL
LigandPNGBDBM50304436(7-(3,5-Difluorobenzyl)-N-(4-morpholin-4-ylphenyl)-...)
Affinity DataIC50:  120nM. Assay description: Inhibition of STAT6 in IL4-stimulated human FW4 reporter cells by luciferase assay
In DepthDetails ArticlePubMed