BDBM50305542 CHEMBL595016::Propane-1-sulfonic acid{(S)-4-[(R)-1-hydroxy-2-(3-isopropyl-benzylamino)-ethyl]-2-oxo-11-oxa-3,16-diaza-tricyclo[15.3.1.1*6,10*]docosa-1(21),6(22),7,9,17,19-hexaen-19-yl}-methyl-amide
SMILES CCCS(=O)(=O)N(C)c1cc2NCCCCOc3cccc(C[C@H](NC(=O)c(c2)c1)[C@H](O)CNCc1cccc(c1)C(C)C)c3
InChI Key InChIKey=HWLAFZXKYIUVHI-SZAHLOSFSA-N
Data  1 IC50
  Tab Delimited (TSV)   2D SDfile   Computed 3D by Vconf -m prep SDfile
Find this compound or compounds like it in BindingDB:
Activity Spreadsheet -- Enzyme Inhibition Constant Data from BindingDB
Found 1 hit for monomerid = 50305542
TargetBeta-secretase 1(Homo sapiens (Human))
Novartis Institutes For Biomedical Research
Curated by ChEMBL
LigandPNGBDBM50305542(CHEMBL595016 | Propane-1-sulfonic acid{(S)-4-[(R)-...)
Affinity DataIC50:  1nM. Assay description: Inhibition of human recombinant BACE1 expressed in Escherichia coli
In DepthDetails ArticlePubMed