BDBM50305577 CHEMBL590362::N-(5-bromo-4-methylthiazol-2-ylcarbamoyl)-3-(difluoromethoxy)benzenesulfonamide
SMILES Cc1nc(NC(=O)NS(=O)(=O)c2cccc(OC(F)F)c2)sc1Br
InChI Key InChIKey=DXBZEWFGCOOOEV-UHFFFAOYSA-N
Data  1 IC50  1 EC50
  Tab Delimited (TSV)   2D SDfile   Computed 3D by Vconf -m prep SDfile
Find this compound or compounds like it in BindingDB:
Activity Spreadsheet -- Enzyme Inhibition Constant Data from BindingDB
Found 2 hits for monomerid = 50305577
TargetFructose-1,6-bisphosphatase 1(Mus musculus)
F. Hoffmann-La Roche
Curated by ChEMBL
LigandPNGBDBM50305577(CHEMBL590362 | N-(5-bromo-4-methylthiazol-2-ylcarb...)
Affinity DataEC50:  1.40E+4nM. Assay description: Inhibition of FBPase in mouse liver
In DepthDetails ArticlePubMed
TargetFructose-1,6-bisphosphatase 1(Homo sapiens (Human))
F. Hoffmann-La Roche
Curated by ChEMBL
LigandPNGBDBM50305577(CHEMBL590362 | N-(5-bromo-4-methylthiazol-2-ylcarb...)
Affinity DataIC50:  170nM. Assay description: Inhibition of FBPase in human liver
In DepthDetails ArticlePubMed