BDBM50305829 4-((5-(2-(4-fluorobenzylcarbamoyl)pyridin-4-yl)-2H-tetrazol-2-yl)methyl)benzoic acid::CHEMBL606155
SMILES OC(=O)c1ccc(Cn2nnc(n2)-c2ccnc(c2)C(=O)NCc2ccc(F)cc2)cc1
InChI Key InChIKey=ZXJYHWUCDSTYKD-UHFFFAOYSA-N
Data  1 KI
  Tab Delimited (TSV)   2D SDfile   Computed 3D by Vconf -m prep SDfile
Find this compound or compounds like it in BindingDB:
Activity Spreadsheet -- Enzyme Inhibition Constant Data from BindingDB
Found 1 hit for monomerid = 50305829
TargetCollagenase 3(Homo sapiens (Human))
Pfizer
Curated by ChEMBL
LigandPNGBDBM50305829(4-((5-(2-(4-fluorobenzylcarbamoyl)pyridin-4-yl)-2H...)
Affinity DataKi:  65nM. Assay description: Inhibition of human recombinant full length MMP13 assessed as type 3 collagen cleavage activity after 18 hrs
In DepthDetails ArticlePubMed