BDBM50305855 CHEMBL595156::trans-4-((5-(2-(4-fluoro-3-methoxybenzylcarbamoyl)-6-methylpyridin-4-yl)-2H-tetrazol-2-yl)methyl)cyclohexanecarboxylic acid
SMILES COc1cc(CNC(=O)c2cc(cc(C)n2)-c2nnn(C[C@H]3CC[C@@H](CC3)C(O)=O)n2)ccc1F
InChI Key InChIKey=WHBYITGVDLNGEB-JCNLHEQBSA-N
Data  1 KI
  Tab Delimited (TSV)   2D SDfile   Computed 3D by Vconf -m prep SDfile
Find this compound or compounds like it in BindingDB:
Activity Spreadsheet -- Enzyme Inhibition Constant Data from BindingDB
Found 1 hit for monomerid = 50305855
TargetCollagenase 3(Homo sapiens (Human))
Pfizer
Curated by ChEMBL
LigandPNGBDBM50305855(CHEMBL595156 | trans-4-((5-(2-(4-fluoro-3-methoxyb...)
Affinity DataKi:  0.300nM. Assay description: Inhibition of human recombinant full length MMP13 assessed as type 3 collagen cleavage activity after 18 hrs
In DepthDetails ArticlePubMed