BDBM50306031 3-(3-(3-(isopropylsulfonyl)phenoxy)phenyl)-2-methyl-8-(trifluoromethyl)imidazo[1,2-a]pyridine::CHEMBL596357
SMILES CC(C)S(=O)(=O)c1cccc(Oc2cccc(c2)-c2c(C)nc3c(cccn23)C(F)(F)F)c1
InChI Key InChIKey=TXKFTWAELLNECY-UHFFFAOYSA-N
Data  2 IC50  2 EC50
  Tab Delimited (TSV)   2D SDfile   Computed 3D by Vconf -m prep SDfile
Find this compound or compounds like it in BindingDB:
Activity Spreadsheet -- Enzyme Inhibition Constant Data from BindingDB
Found 4 hits for monomerid = 50306031
TargetOxysterols receptor LXR-beta(Homo sapiens (Human))
Wyeth Pharmaceuticals
Curated by ChEMBL
LigandPNGBDBM50306031(3-(3-(3-(isopropylsulfonyl)phenoxy)phenyl)-2-methy...)
Affinity DataEC50:  4.10E+3nM. Assay description: Agonist activity at human Gal4-LBD fused LXRbeta LBD expressed in Huh7 cells by transient transactivation assay
In DepthDetails ArticlePubMed
TargetOxysterols receptor LXR-alpha(Homo sapiens (Human))
Wyeth Pharmaceuticals
Curated by ChEMBL
LigandPNGBDBM50306031(3-(3-(3-(isopropylsulfonyl)phenoxy)phenyl)-2-methy...)
Affinity DataIC50:  33nM. Assay description: Displacement of [3H]T0901317 from human recombinant LXRalpha LBD
In DepthDetails ArticlePubMed
TargetOxysterols receptor LXR-beta(Homo sapiens (Human))
Wyeth Pharmaceuticals
Curated by ChEMBL
LigandPNGBDBM50306031(3-(3-(3-(isopropylsulfonyl)phenoxy)phenyl)-2-methy...)
Affinity DataIC50:  960nM. Assay description: Displacement of [3H]T0901317 from human recombinant LXRbeta LBD
In DepthDetails ArticlePubMed
TargetOxysterols receptor LXR-alpha(Homo sapiens (Human))
Wyeth Pharmaceuticals
Curated by ChEMBL
LigandPNGBDBM50306031(3-(3-(3-(isopropylsulfonyl)phenoxy)phenyl)-2-methy...)
Affinity DataEC50:  700nM. Assay description: Agonist activity at human Gal4-LBD fused LXRalpha LBD expressed in Huh7 cells by transient transactivation assay
In DepthDetails ArticlePubMed