BDBM50306290 4-(1-(cyclopropylmethyl)-3-(3-hydroxyphenyl)piperidin-3-yl)-N-ethyl-N-methylbenzamide::CHEMBL592908
SMILES CCN(C)C(=O)c1ccc(cc1)C1(CCCN(CC2CC2)C1)c1cccc(O)c1
InChI Key InChIKey=RXKVSPJEZMPYDL-UHFFFAOYSA-N
Data  3 KI
  Tab Delimited (TSV)   2D SDfile   Computed 3D by Vconf -m prep SDfile
Find this compound or compounds like it in BindingDB:
Activity Spreadsheet -- Enzyme Inhibition Constant Data from BindingDB
Found 3 hits for monomerid = 50306290
TargetDelta-type opioid receptor(Homo sapiens (Human))
Pfizer
Curated by ChEMBL
LigandPNGBDBM50306290(4-(1-(cyclopropylmethyl)-3-(3-hydroxyphenyl)piperi...)
Affinity DataKi:  2.20nM. Assay description: Displacement of [125I]diprenorphine from human delta opioid receptor expressed in CHO cells by liquid scintillation counting
In DepthDetails ArticlePubMed
TargetMu-type opioid receptor(Homo sapiens (Human))
Pfizer
Curated by ChEMBL
LigandPNGBDBM50306290(4-(1-(cyclopropylmethyl)-3-(3-hydroxyphenyl)piperi...)
Affinity DataKi:  52nM. Assay description: Displacement of [125I]diprenorphine from human mu opioid receptor expressed in CHO cells by liquid scintillation counting
In DepthDetails ArticlePubMed
TargetKappa-type opioid receptor(Homo sapiens (Human))
Pfizer
Curated by ChEMBL
LigandPNGBDBM50306290(4-(1-(cyclopropylmethyl)-3-(3-hydroxyphenyl)piperi...)
Affinity DataKi:  66nM. Assay description: Displacement of [125I]diprenorphine from human kappa opioid receptor expressed in CHO cells by liquid scintillation counting
In DepthDetails ArticlePubMed