BDBM50306297 4-(1-allyl-4-(3-hydroxyphenyl)piperidin-4-yl)-N,N-diethylbenzamide::CHEMBL605931
SMILES CCN(CC)C(=O)c1ccc(cc1)C1(CCN(CC=C)CC1)c1cccc(O)c1
InChI Key InChIKey=GHGXXGRQBXBJPK-UHFFFAOYSA-N
Data  3 KI
  Tab Delimited (TSV)   2D SDfile   Computed 3D by Vconf -m prep SDfile
Find this compound or compounds like it in BindingDB:
Activity Spreadsheet -- Enzyme Inhibition Constant Data from BindingDB
Found 3 hits for monomerid = 50306297
TargetDelta-type opioid receptor(Homo sapiens (Human))
Pfizer
Curated by ChEMBL
LigandPNGBDBM50306297(4-(1-allyl-4-(3-hydroxyphenyl)piperidin-4-yl)-N,N-...)
Affinity DataKi:  1.90nM. Assay description: Displacement of [125I]diprenorphine from human delta opioid receptor expressed in CHO cells by liquid scintillation counting
In DepthDetails ArticlePubMed
TargetKappa-type opioid receptor(Homo sapiens (Human))
Pfizer
Curated by ChEMBL
LigandPNGBDBM50306297(4-(1-allyl-4-(3-hydroxyphenyl)piperidin-4-yl)-N,N-...)
Affinity DataKi:  347nM. Assay description: Displacement of [125I]diprenorphine from human kappa opioid receptor expressed in CHO cells by liquid scintillation counting
In DepthDetails ArticlePubMed
TargetMu-type opioid receptor(Homo sapiens (Human))
Pfizer
Curated by ChEMBL
LigandPNGBDBM50306297(4-(1-allyl-4-(3-hydroxyphenyl)piperidin-4-yl)-N,N-...)
Affinity DataKi: >890nM. Assay description: Displacement of [125I]diprenorphine from human mu opioid receptor expressed in CHO cells by liquid scintillation counting
In DepthDetails ArticlePubMed