BDBM50306329 CHEMBL604135::N-((6aS,13bS)-11-chloro-12-hydroxy-7-methyl-6,6a,7,8,9,13b-hexahydro-5H-benzo[d]naphtho[2,1-b]azepin-4-yl)methanesulfonamide
SMILES CN1CCc2cc(Cl)c(O)cc2[C@@H]2[C@@H]1CCc1c(NS(C)(=O)=O)cccc21
InChI Key InChIKey=ZAGHVNSWDNQPSI-AZUAARDMSA-N
Data  2 KI
  Tab Delimited (TSV)   2D SDfile   Computed 3D by Vconf -m prep SDfile
Find this compound or compounds like it in BindingDB:
Activity Spreadsheet -- Enzyme Inhibition Constant Data from BindingDB
Found 2 hits for monomerid = 50306329
TargetD(1A) dopamine receptor(Homo sapiens (Human))
Merck Research Laboratories
Curated by ChEMBL
LigandPNGBDBM50306329(CHEMBL604135 | N-((6aS,13bS)-11-chloro-12-hydroxy-...)
Affinity DataKi:  4.70nM. Assay description: Binding affinity to dopamine D1 receptor
In DepthDetails ArticlePubMed
TargetD(2) dopamine receptor(Homo sapiens (Human))
Merck Research Laboratories
Curated by ChEMBL
LigandPNGBDBM50306329(CHEMBL604135 | N-((6aS,13bS)-11-chloro-12-hydroxy-...)
Affinity DataKi:  1.00E+3nM. Assay description: Binding affinity to dopamine D2 receptor
In DepthDetails ArticlePubMed