BDBM50306401 5-(4-benzylbenzyl)thiazolidine-2,4-dione::CHEMBL599270
SMILES Oc1[nH]c(=O)sc1Cc1ccc(Cc2ccccc2)cc1
InChI Key InChIKey=TWDPSBJRUWGHJI-UHFFFAOYSA-N
Data  1 EC50
  Tab Delimited (TSV)   2D SDfile   Computed 3D by Vconf -m prep SDfile
Find this compound or compounds like it in BindingDB:
Activity Spreadsheet -- Enzyme Inhibition Constant Data from BindingDB
Found 1 hit for monomerid = 50306401
TargetFree fatty acid receptor 1(Homo sapiens (Human))
Merck Research Laboratories
Curated by ChEMBL
LigandPNGBDBM50306401(5-(4-benzylbenzyl)thiazolidine-2,4-dione | CHEMBL5...)
Affinity DataEC50:  9.28E+3nM. Assay description: Agonist activity at human GPR40 by FLIPR assay in presence of 1% BSA
In DepthDetails ArticlePubMed