BDBM50306553 1-(beta-D-Glucopyranosyl)-1,2,3-triazole-4-carboxamide::CHEMBL597136
SMILES NOC(=O)c1cn(nn1)[C@@H]1O[C@H](CO)[C@@H](O)[C@H](O)[C@H]1O
InChI Key InChIKey=QYUNEFBEMIOPOB-JAJWTYFOSA-N
Data  1 IC50
  Tab Delimited (TSV)   2D SDfile   Computed 3D by Vconf -m prep SDfile
Find this compound or compounds like it in BindingDB:
Activity Spreadsheet -- Enzyme Inhibition Constant Data from BindingDB
Found 1 hit for monomerid = 50306553
TargetGlycogen phosphorylase, muscle form(Oryctolagus cuniculus (rabbit))
University Of Debrecen
Curated by ChEMBL
LigandPNGBDBM50306553(1-(beta-D-Glucopyranosyl)-1,2,3-triazole-4-carboxa...)
Affinity DataIC50:  3.50E+5nM. Assay description: Inhibition of rabbit skeletal muscle glycogen phosphorylase b by Lineweaver-Burk plot analysis
In DepthDetails ArticlePubMed