BDBM50306746 3-(5-amino-4-carbamoyloxazol-2-yl)phenyl acetate::CHEMBL599548
SMILES CC(=O)Oc1cccc(c1)-c1nc(C(N)=O)c(N)o1
InChI Key InChIKey=STTDMIUGCZTANE-UHFFFAOYSA-N
Data  1 KI
  Tab Delimited (TSV)   2D SDfile   Computed 3D by Vconf -m prep SDfile
Find this compound or compounds like it in BindingDB:
Activity Spreadsheet -- Enzyme Inhibition Constant Data from BindingDB
Found 1 hit for monomerid = 50306746
TargetAdenosine receptor A2a(Homo sapiens (Human))
The Scripps Research Institute
Curated by ChEMBL
LigandPNGBDBM50306746(3-(5-amino-4-carbamoyloxazol-2-yl)phenyl acetate |...)
Affinity DataKi:  3.60E+4nM. Assay description: Inhibition of human adenosine 2A receptor
In DepthDetails ArticlePubMed