BDBM50306795 2-((4-amino-6-(o-tolylamino)-1,3,5-triazin-2-yl)methylthio)-N-o-tolylacetamide::CHEMBL605584
SMILES Cc1ccccc1NC(=O)CSCc1nc(N)nc(Nc2ccccc2C)n1
InChI Key InChIKey=BCYDLVQGCNQEHP-UHFFFAOYSA-N
Data  1 KI
  Tab Delimited (TSV)   2D SDfile   Computed 3D by Vconf -m prep SDfile
Find this compound or compounds like it in BindingDB:
Activity Spreadsheet -- Enzyme Inhibition Constant Data from BindingDB
Found 1 hit for monomerid = 50306795
TargetAdenosine receptor A2a(Homo sapiens (Human))
The Scripps Research Institute
Curated by ChEMBL
LigandPNGBDBM50306795(2-((4-amino-6-(o-tolylamino)-1,3,5-triazin-2-yl)me...)
Affinity DataKi: >1.00E+5nM. Assay description: Inhibition of human adenosine 2A receptor
In DepthDetails ArticlePubMed