BDBM50306906 ((R)-7-(3,4-dichlorophenyl)-5-methyl-4,7-dihydropyrazolo[1,5-a]pyrimidin-6-yl)((S)-2-(4-fluorophenyl)pyrrolidin-1-yl)methanone::CHEMBL602070
SMILES CC1=Nc2ccnn2[C@@H](C1C(=O)N1CCC[C@H]1c1ccc(F)cc1)c1ccc(Cl)c(Cl)c1
InChI Key InChIKey=HLUPWWBAEWIMAO-XLSWHLDHSA-N
Data  1 IC50
  Tab Delimited (TSV)   2D SDfile   Computed 3D by Vconf -m prep SDfile
Find this compound or compounds like it in BindingDB:
Activity Spreadsheet -- Enzyme Inhibition Constant Data from BindingDB
Found 1 hit for monomerid = 50306906
TargetPotassium voltage-gated channel subfamily A member 5(Homo sapiens (Human))
Bristol-Myers Squibb Pharmaceutical Research And Development
Curated by ChEMBL
LigandPNGBDBM50306906(((R)-7-(3,4-dichlorophenyl)-5-methyl-4,7-dihydropy...)
Affinity DataIC50:  50nM. Assay description: Inhibition of human Kv1.5 channel expressed in mouse L929 cells
In DepthDetails ArticlePubMed