BDBM50307093 CHEMBL591955::N-(3-fluoro-2'-(methylsulfonyl)biphenyl-4-yl)-1-(3-(5-oxo-4,5-dihydro-1H-1,2,4-triazol-3-yl)phenyl)-3-(trifluoromethyl)-1H-pyrazole-5-carboxamide
SMILES CS(=O)(=O)c1ccccc1-c1ccc(NC(=O)c2cc(nn2-c2cccc(c2)-c2n[nH]c(=O)[nH]2)C(F)(F)F)c(F)c1
InChI Key InChIKey=YIHPFOJBRPDMES-UHFFFAOYSA-N
Data  2 KI
PDB links: 1 PDB ID matches this monomer.
  Tab Delimited (TSV)   2D SDfile   Computed 3D by Vconf -m prep SDfile
Find this compound or compounds like it in BindingDB:
Activity Spreadsheet -- Enzyme Inhibition Constant Data from BindingDB
Found 2 hits for monomerid = 50307093
TargetCoagulation factor X(Homo sapiens (Human))
Bristol-Myers Squibb
Curated by ChEMBL
LigandPNGBDBM50307093(CHEMBL591955 | N-(3-fluoro-2'-(methylsulfonyl)biph...)
Affinity DataKi:  0.5nM. Assay description: Inhibition of human factor 10a
TargetProthrombin(Homo sapiens (Human))
Bristol-Myers Squibb
Curated by ChEMBL
LigandPNGBDBM50307093(CHEMBL591955 | N-(3-fluoro-2'-(methylsulfonyl)biph...)
Affinity DataKi: >2.10E+4nM. Assay description: Inhibition of human factor 2a
In DepthDetails ArticlePubMed