BDBM50307317 4-(2-Carbamimidoyl-benzo[b]thiophen-6-yloxymethyl)-benzoic acid methyl ester::CHEMBL599840
SMILES CC(=O)Oc1ccc(COc2cccc(c2)-c2ccc3sc(cc3c2)C(N)=N)cc1
InChI Key InChIKey=XLXZUXUEXZIGPF-UHFFFAOYSA-N
Data  1 KI
  Tab Delimited (TSV)   2D SDfile   Computed 3D by Vconf -m prep SDfile
Find this compound or compounds like it in BindingDB:
Activity Spreadsheet -- Enzyme Inhibition Constant Data from BindingDB
Found 1 hit for monomerid = 50307317
TargetCoagulation factor IX(Homo sapiens (Human))
Trigen
Curated by ChEMBL
LigandPNGBDBM50307317(4-(2-Carbamimidoyl-benzo[b]thiophen-6-yloxymethyl)...)
Affinity DataKi:  1.13E+4nM. Assay description: Inhibition of human recombinant factor 9a by amidolytic assay
In DepthDetails ArticlePubMed