BDBM50307334 5-(3,4-Dimethoxyphenyl)benzo[b]thiophene-2-carboxamidine::CHEMBL598384
SMILES COc1ccc(cc1OC)-c1ccc2sc(cc2c1)C(N)=N
InChI Key InChIKey=FHFYJPXHDJXVJS-UHFFFAOYSA-N
Data  2 KI
  Tab Delimited (TSV)   2D SDfile   Computed 3D by Vconf -m prep SDfile
Find this compound or compounds like it in BindingDB:
Activity Spreadsheet -- Enzyme Inhibition Constant Data from BindingDB
Found 2 hits for monomerid = 50307334
TargetCoagulation factor IX(Homo sapiens (Human))
Trigen
Curated by ChEMBL
LigandPNGBDBM50307334(5-(3,4-Dimethoxyphenyl)benzo[b]thiophene-2-carboxa...)
Affinity DataKi:  5.90E+3nM. Assay description: Inhibition of human recombinant factor 9a by amidolytic assay
In DepthDetails ArticlePubMedMMDB
TargetCoagulation factor X(Homo sapiens (Human))
Trigen
Curated by ChEMBL
LigandPNGBDBM50307334(5-(3,4-Dimethoxyphenyl)benzo[b]thiophene-2-carboxa...)
Affinity DataKi:  1.19E+4nM. Assay description: Inhibition of factor 10 by amidolytic assay
In DepthDetails ArticlePubMed