BDBM50307897 3'-((1H-1,2,4-triazol-1-yl)methyl)-5'-cyanobiphenyl-4-yl sulfamate::CHEMBL598627
SMILES NS(=O)(=O)Oc1ccc(cc1)-c1cc(Cn2cncn2)cc(c1)C#N
InChI Key InChIKey=QASDJMZDWWGTMO-UHFFFAOYSA-N
Data  2 IC50
  Tab Delimited (TSV)   2D SDfile   Computed 3D by Vconf -m prep SDfile
Find this compound or compounds like it in BindingDB:
Activity Spreadsheet -- Enzyme Inhibition Constant Data from BindingDB
Found 2 hits for monomerid = 50307897
TargetSteryl-sulfatase(Homo sapiens (Human))
University Of Bath
Curated by ChEMBL
LigandPNGBDBM50307897(3'-((1H-1,2,4-triazol-1-yl)methyl)-5'-cyanobipheny...)
Affinity DataIC50: >1.00E+4nM. Assay description: Inhibition of steroid sulfatase in human JEG3 cells by scintillation spectrometry
In DepthDetails ArticlePubMed
TargetAromatase(Homo sapiens (Human))
University Of Bath
Curated by ChEMBL
LigandPNGBDBM50307897(3'-((1H-1,2,4-triazol-1-yl)methyl)-5'-cyanobipheny...)
Affinity DataIC50:  280nM. Assay description: Inhibition of aromatse in human JEG3 cells by scintillation spectrometry
In DepthDetails ArticlePubMed