BDBM50307911 4-((1H-1,2,4-triazol-1-yl)methyl)biphenyl-2-carbonitrile::CHEMBL608153
SMILES N#Cc1cc(Cn2cncn2)ccc1-c1ccccc1
InChI Key InChIKey=XXLOSISKPNPYGN-UHFFFAOYSA-N
Data  1 IC50
  Tab Delimited (TSV)   2D SDfile   Computed 3D by Vconf -m prep SDfile
Find this compound or compounds like it in BindingDB:
Activity Spreadsheet -- Enzyme Inhibition Constant Data from BindingDB
Found 1 hit for monomerid = 50307911
TargetAromatase(Homo sapiens (Human))
University Of Bath
Curated by ChEMBL
LigandPNGBDBM50307911(4-((1H-1,2,4-triazol-1-yl)methyl)biphenyl-2-carbon...)
Affinity DataIC50:  4.60nM. Assay description: Inhibition of aromatse in human JEG3 cells by scintillation spectrometry
In DepthDetails ArticlePubMed