BDBM50308151 1-[4-(4,6-Dimorpholin-4-yl-1,3,5-triazin-2-yl)-phenyl]-4-pyridin-4-ylurea::CHEMBL596597
SMILES O=C(Nc1ccncc1)Nc1ccc(cc1)-c1nc(nc(n1)N1CCOCC1)N1CCOCC1
InChI Key InChIKey=FVOXAVYMKTXHTN-UHFFFAOYSA-N
Data  3 IC50
  Tab Delimited (TSV)   2D SDfile   Computed 3D by Vconf -m prep SDfile
Find this compound or compounds like it in BindingDB:
Activity Spreadsheet -- Enzyme Inhibition Constant Data from BindingDB
Found 3 hits for monomerid = 50308151
LigandPNGBDBM50308151(1-[4-(4,6-Dimorpholin-4-yl-1,3,5-triazin-2-yl)-phe...)
Affinity DataIC50:  3nM. Assay description: Inhibition of PI3Kalpha
In DepthDetails ArticlePubMed
TargetSerine/threonine-protein kinase mTOR(Homo sapiens (Human))
Wyeth Research
Curated by ChEMBL
LigandPNGBDBM50308151(1-[4-(4,6-Dimorpholin-4-yl-1,3,5-triazin-2-yl)-phe...)
Affinity DataIC50:  1.20nM. Assay description: Inhibition of mTOR
In DepthDetails ArticlePubMed
LigandPNGBDBM50308151(1-[4-(4,6-Dimorpholin-4-yl-1,3,5-triazin-2-yl)-phe...)
Affinity DataIC50:  28.5nM. Assay description: Inhibition of PI3Kgamma
In DepthDetails ArticlePubMed