BDBM50308440 (2S,3R,4R,5S,6R)-2-(4-Chloro-3-((5-phenyl-1,3,4-thiadiazol-2-yl)methyl)phenyl)-6-(hydroxymethyl)-tetrahydro-2H-pyran-3,4,5-triol::CHEMBL603167::US8541380, 28
SMILES OC[C@H]1O[C@H]([C@H](O)[C@@H](O)[C@@H]1O)c1ccc(Cl)c(Cc2nnc(s2)-c2ccccc2)c1
InChI Key InChIKey=RQZJBAOEHONXHJ-PKOFMYQESA-N
Data  2 IC50
  Tab Delimited (TSV)   2D SDfile   Computed 3D by Vconf -m prep SDfile
Find this compound or compounds like it in BindingDB:
Activity Spreadsheet -- Enzyme Inhibition Constant Data from BindingDB
Found 2 hits for monomerid = 50308440
TargetSodium/glucose cotransporter 2(Homo sapiens (Human))
Green Cross
Curated by ChEMBL
LigandPNGBDBM50308440((2S,3R,4R,5S,6R)-2-(4-Chloro-3-((5-phenyl-1,3,4-th...)
Affinity DataIC50:  16.6nM. Assay description: Inhibition of human recombinant SGLT2 expressed in CHO cells by liquid scintillation counting
In DepthDetails ArticlePubMed
TargetSodium/glucose cotransporter 2(Homo sapiens (Human))
Green Cross
Curated by ChEMBL
LigandPNGBDBM50308440((2S,3R,4R,5S,6R)-2-(4-Chloro-3-((5-phenyl-1,3,4-th...)
Affinity DataIC50:  16.6nM. Assay description: Inhibition assay using hSGLT2.
In DepthDetails US Patent