BDBM50308566 8-(4-(3,6,9,12-tetraoxatricos-22-enyloxy)phenyl)-theophylline::CHEMBL589251
SMILES Cn1c2nc([nH]c2c(=O)n(C)c1=O)-c1ccc(OCCOCCOCCOCCOCCCCCCCCCCC=C)cc1
InChI Key InChIKey=VVFSRAIHBDLLMD-UHFFFAOYSA-N
Data  2 KI
  Tab Delimited (TSV)   2D SDfile   Computed 3D by Vconf -m prep SDfile
Find this compound or compounds like it in BindingDB:
Activity Spreadsheet -- Enzyme Inhibition Constant Data from BindingDB
Found 2 hits for monomerid = 50308566
TargetAdenosine receptor A2b(Homo sapiens (Human))
Universidad De M£Laga
Curated by ChEMBL
LigandPNGBDBM50308566(8-(4-(3,6,9,12-tetraoxatricos-22-enyloxy)phenyl)-t...)
Affinity DataKi:  4.16nM. Assay description: Displacement of [3H]DPCPX from human recombinant adenosine A2B receptor expressed in HEK293 cell membrane
In DepthDetails ArticlePubMed
TargetAdenosine receptor A2a(Homo sapiens (Human))
Universidad De M£Laga
Curated by ChEMBL
LigandPNGBDBM50308566(8-(4-(3,6,9,12-tetraoxatricos-22-enyloxy)phenyl)-t...)
Affinity DataKi:  100nM. Assay description: Displacement of [3H]ZM241385 from human recombinant adenosine A2A receptor expressed in in human HeLa cell membrane
In DepthDetails ArticlePubMed