BDBM50308701 5-(Phenylsulfonyl)-N-{1-[(3S)-pyrrolidin-3-ylcarbonyl]-piperidin-4-yl}-2-(trifluoromethyl)benzenesulfonamide::CHEMBL592670
SMILES FC(F)(F)c1ccc(cc1S(=O)(=O)NC1CCN(CC1)C(=O)[C@H]1CCNC1)S(=O)(=O)c1ccccc1
InChI Key InChIKey=GMKQKEGOSSISFQ-INIZCTEOSA-N
Data  1 IC50  1 EC50
  Tab Delimited (TSV)   2D SDfile   Computed 3D by Vconf -m prep SDfile
Find this compound or compounds like it in BindingDB:
Activity Spreadsheet -- Enzyme Inhibition Constant Data from BindingDB
Found 2 hits for monomerid = 50308701
TargetSecreted frizzled-related protein 1(Homo sapiens (Human))
Wyeth Research
Curated by ChEMBL
LigandPNGBDBM50308701(5-(Phenylsulfonyl)-N-{1-[(3S)-pyrrolidin-3-ylcarbo...)
Affinity DataIC50:  40nM. Assay description: Displacement of fluorescence probe compound from human SFRP1 after 30 mins by fluorescence polarization assay
In DepthDetails ArticlePubMed
TargetSecreted frizzled-related protein 1(Homo sapiens (Human))
Wyeth Research
Curated by ChEMBL
LigandPNGBDBM50308701(5-(Phenylsulfonyl)-N-{1-[(3S)-pyrrolidin-3-ylcarbo...)
Affinity DataEC50:  700nM. Assay description: Inhibition of human recombinant SFRP1 expressed in human U2OS cells assessed as increase in Wnt signaling after 16 to 18 hrs by luciferase reporter g...
In DepthDetails ArticlePubMed