BDBM50308768 1-[4-(3-Ethyl-7-morpholin-4-yl-3H-[1,2,3]triazolo-[4,5-d]pyrimidin-5-yl)phenyl]-3-pyridin-4-ylurea::CHEMBL590073
SMILES CCn1nnc2c(nc(nc12)-c1ccc(NC(=O)Nc2ccncc2)cc1)N1CCOCC1
InChI Key InChIKey=VPLAAHHOBJVHMP-UHFFFAOYSA-N
Data  3 IC50
  Tab Delimited (TSV)   2D SDfile   Computed 3D by Vconf -m prep SDfile
Find this compound or compounds like it in BindingDB:
Activity Spreadsheet -- Enzyme Inhibition Constant Data from BindingDB
Found 3 hits for monomerid = 50308768
LigandPNGBDBM50308768(1-[4-(3-Ethyl-7-morpholin-4-yl-3H-[1,2,3]triazolo-...)
Affinity DataIC50:  5nM. Assay description: Inhibition of human PI3Kalpha by fluorescence polarization format assay
In DepthDetails ArticlePubMed
TargetSerine/threonine-protein kinase mTOR(Homo sapiens (Human))
Wyeth Research
Curated by ChEMBL
LigandPNGBDBM50308768(1-[4-(3-Ethyl-7-morpholin-4-yl-3H-[1,2,3]triazolo-...)
Affinity DataIC50:  0.630nM. Assay description: Inhibition of mTOR by DELFIA
In DepthDetails ArticlePubMed
LigandPNGBDBM50308768(1-[4-(3-Ethyl-7-morpholin-4-yl-3H-[1,2,3]triazolo-...)
Affinity DataIC50:  18.5nM. Assay description: Inhibition of human PI3Kgamma by fluorescence polarization format assay
In DepthDetails ArticlePubMed