BDBM50308972 1-Benzotriazol-1-yl-3-(4-octylphenoxy)propan-2-one::CHEMBL590142
SMILES CCCCCCCCc1ccc(OCC(=O)Cn2nnc3ccccc23)cc1
InChI Key InChIKey=NUJHMVSKPPLIJB-UHFFFAOYSA-N
Data  3 IC50
  Tab Delimited (TSV)   2D SDfile   Computed 3D by Vconf -m prep SDfile
Find this compound or compounds like it in BindingDB:
Activity Spreadsheet -- Enzyme Inhibition Constant Data from BindingDB
Found 3 hits for monomerid = 50308972
TargetFatty-acid amide hydrolase 1 [30-579](Rattus norvegicus (rat))
University Of M£Nster
Curated by ChEMBL
LigandPNGBDBM50308972(1-Benzotriazol-1-yl-3-(4-octylphenoxy)propan-2-one...)
Affinity DataIC50:  47nM. Assay description: Inhibition of FAAH from rat brain microsomes by RP-HPLC
In DepthDetails ArticlePubMed
TargetFatty-acid amide hydrolase 1 [30-579](Rattus norvegicus (rat))
University Of M£Nster
Curated by ChEMBL
LigandPNGBDBM50308972(1-Benzotriazol-1-yl-3-(4-octylphenoxy)propan-2-one...)
Affinity DataIC50:  15nM. Assay description: Inhibition of FAAH in rat brain microsomes using N-(2-hydroxyethyl)-4-pyren-1-ylbutanamide as substrate after 60 mins by fluorescence-based reversed ...
In DepthDetails ArticlePubMed
TargetCytosolic phospholipase A2(Homo sapiens (Human))
University Of M£Nster
Curated by ChEMBL
LigandPNGBDBM50308972(1-Benzotriazol-1-yl-3-(4-octylphenoxy)propan-2-one...)
Affinity DataIC50:  2.20E+3nM. Assay description: Inhibition of cPLA2 from human platelets by RP-HPLC
In DepthDetails ArticlePubMed