BDBM50309188 4-(2-amino-5-(3,4,5-trimethoxyphenyl)pyridin-3-yl)-2-methoxyphenol::CHEMBL590793::US10688093, Compound 382_0314_0087::US11701353, Compound 382_0314_0087
SMILES COc1cc(ccc1O)-c1cc(cnc1N)-c1cc(OC)c(OC)c(OC)c1
InChI Key InChIKey=GUBPYJJIGUBALI-UHFFFAOYSA-N
Data  5 IC50
  Tab Delimited (TSV)   2D SDfile   Computed 3D by Vconf -m prep SDfile
Find this compound or compounds like it in BindingDB:
Activity Spreadsheet -- Enzyme Inhibition Constant Data from BindingDB
Found 3 hits for monomerid = 50309188
TargetSerine/threonine-protein kinase Chk2(Homo sapiens (Human))
The Institute Of Cancer Research
Curated by ChEMBL
LigandPNGBDBM50309188(4-(2-amino-5-(3,4,5-trimethoxyphenyl)pyridin-3-yl)...)
Affinity DataIC50:  3.00E+3nM. Assay description: Inhibition of CHK2 in human HT29 cells
In DepthDetails ArticlePubMed
TargetTyrosine-protein kinase Fyn(Homo sapiens (Human))
TBA
US Patent
LigandPNGBDBM50309188(4-(2-amino-5-(3,4,5-trimethoxyphenyl)pyridin-3-yl)...)
Affinity DataIC50:  116nM. Assay description: The assay procedure determines the IC50 of each potential FYN kinase inhibitor by measuring the enzyme catalyzed ATP-dependent phosphorylation of the...
In DepthDetails US Patent
TargetTyrosine-protein kinase Fyn(Homo sapiens (Human))
TBA
US Patent
LigandPNGBDBM50309188(4-(2-amino-5-(3,4,5-trimethoxyphenyl)pyridin-3-yl)...)
Affinity DataIC50:  80.6nM. Assay description: The assay procedure determines the IC50 of each potential FYN kinase inhibitor by measuring the enzyme catalyzed ATP-dependent phosphorylation of the...
In DepthDetails US Patent