BDBM50309771 8-bromo-5-(isopentylamino)-6H-[1,2,3]triazolo[4,5,1-de]acridin-6-one::CHEMBL598874
SMILES CC(C)CCNc1ccc2nnn3c2c1c(=O)c1cc(Br)ccc31
InChI Key InChIKey=QFLIDLCNJLCZDM-UHFFFAOYSA-N
Data  2 IC50
  Tab Delimited (TSV)   2D SDfile   Computed 3D by Vconf -m prep SDfile
Find this compound or compounds like it in BindingDB:
Activity Spreadsheet -- Enzyme Inhibition Constant Data from BindingDB
Found 2 hits for monomerid = 50309771
TargetNAD(P)H dehydrogenase [quinone] 1(Homo sapiens (Human))
University Of Manchester And Manchester Cancer Research Center
Curated by ChEMBL
LigandPNGBDBM50309771(8-bromo-5-(isopentylamino)-6H-[1,2,3]triazolo[4,5,...)
Affinity DataIC50:  107nM. Assay description: Inhibition of human recombinant NQO1 by spectrophotometry
In DepthDetails ArticlePubMed
TargetRibosyldihydronicotinamide dehydrogenase [quinone](Homo sapiens (Human))
University Of Manchester And Manchester Cancer Research Center
Curated by ChEMBL
LigandPNGBDBM50309771(8-bromo-5-(isopentylamino)-6H-[1,2,3]triazolo[4,5,...)
Affinity DataIC50:  767nM. Assay description: Inhibition of human recombinant NQO2 by spectrophotometry
In DepthDetails ArticlePubMed