BDBM50309936 (4-Hydroxy-2-methyl-1,1-dioxo-1,2-dihydro-1lambda*6*-benzo[e][1,2]thiazin-3-yl)-phenyl-methanone::CHEMBL599588
SMILES CN1C(C(=O)c2ccccc2)=C(O)c2ccccc2S1(=O)=O
InChI Key InChIKey=XAUOVEXCNXTYPT-UHFFFAOYSA-N
Data  1 IC50
  Tab Delimited (TSV)   2D SDfile   Computed 3D by Vconf -m prep SDfile
Find this compound or compounds like it in BindingDB:
Activity Spreadsheet -- Enzyme Inhibition Constant Data from BindingDB
Found 1 hit for monomerid = 50309936
Target11-beta-hydroxysteroid dehydrogenase 1(Homo sapiens (Human))
Korea University
Curated by ChEMBL
LigandPNGBDBM50309936((4-Hydroxy-2-methyl-1,1-dioxo-1,2-dihydro-1lambda*...)
Affinity DataIC50:  388nM. Assay description: Inhibition of 11beta-HSD1 in human microsomes by HTRF cortisol assay
In DepthDetails ArticlePubMed