BDBM50310029 (4-((1H-1,2,4-Triazol-1-yl)methyl)-5-(4-chlorophenyl)-1-(2,4-dichlorophenyl)-1H-pyrazol-3-yl)(4-methylpiperazin-1-yl)methanone::CHEMBL598455
SMILES CN1CCN(CC1)C(=O)c1nn(c(c1Cn1cncn1)-c1ccc(Cl)cc1)-c1ccc(Cl)cc1Cl
InChI Key InChIKey=KPNZECKKRFLENY-UHFFFAOYSA-N
Data  1 IC50
  Tab Delimited (TSV)   2D SDfile   Computed 3D by Vconf -m prep SDfile
Find this compound or compounds like it in BindingDB:
Activity Spreadsheet -- Enzyme Inhibition Constant Data from BindingDB
Found 1 hit for monomerid = 50310029
TargetCannabinoid receptor 1(Rattus norvegicus (rat))
Green Cross
Curated by ChEMBL
LigandPNGBDBM50310029((4-((1H-1,2,4-Triazol-1-yl)methyl)-5-(4-chlorophen...)
Affinity DataIC50:  1.42E+3nM. Assay description: Displacement of [3H]CP55,940 from CB1 receptor in Sprague-Dawley rat cerebellar membrane
In DepthDetails ArticlePubMed