BDBM50310088 (6,7-difluoro-8H-indeno[1,2-d]thiazol-4-yloxy)methylphosphonic acid::CHEMBL592639
SMILES OP(O)(=O)COc1cc(F)c(F)c2Cc3scnc3-c12
InChI Key InChIKey=RXEOTIDNKYYJQV-UHFFFAOYSA-N
Data  1 IC50
  Tab Delimited (TSV)   2D SDfile   Computed 3D by Vconf -m prep SDfile
Find this compound or compounds like it in BindingDB:
Activity Spreadsheet -- Enzyme Inhibition Constant Data from BindingDB
Found 1 hit for monomerid = 50310088
TargetFructose-1,6-bisphosphatase 1(Homo sapiens (Human))
Daiichi Sankyo
Curated by ChEMBL
LigandPNGBDBM50310088((6,7-difluoro-8H-indeno[1,2-d]thiazol-4-yloxy)meth...)
Affinity DataIC50:  9nM. Assay description: Inhibition of human liver recombinant FBPase
In DepthDetails ArticlePubMed