BDBM50310599 5,6-dimethoxy-1-oxo-2,3-dihydro-1H-2-indenyl-3,4,5-trimethoxyphenylmethanone::5,6-dimethoxy-2-(3,4,5-trimethoxybenzoyl)-2,3-dihydro-1H-inden-1-one::CHEMBL1078448
SMILES COc1cc2CC(C(=O)c3cc(OC)c(OC)c(OC)c3)C(=O)c2cc1OC
InChI Key InChIKey=UQKXCGKVDCHFBT-UHFFFAOYSA-N
Data  1 IC50
  Tab Delimited (TSV)   2D SDfile   Computed 3D by Vconf -m prep SDfile
Find this compound or compounds like it in BindingDB:
Activity Spreadsheet -- Enzyme Inhibition Constant Data from BindingDB
Found 1 hit for monomerid = 50310599
TargetAcetylcholinesterase(Electrophorus electricus (Electric eel))
Alwar Pharmacy College
Curated by ChEMBL
LigandPNGBDBM50310599(5,6-dimethoxy-1-oxo-2,3-dihydro-1H-2-indenyl-3,4,5...)
Affinity DataIC50:  2.70E+3nM. Assay description: Inhibition of Electrophorus electricus AChE by Ellman's method
In DepthDetails ArticlePubMed