BDBM50311013 CHEMBL1078159::N-(cyanomethyl)-3-(2-(4-morpholinophenylamino)pyrimidin-4-yl)benzamide
SMILES O=C(NCC#N)c1cccc(c1)-c1ccnc(Nc2ccc(cc2)N2CCOCC2)n1
InChI Key InChIKey=DKSMHPPLVBSAQL-UHFFFAOYSA-N
Data  2 IC50
  Tab Delimited (TSV)   2D SDfile   Computed 3D by Vconf -m prep SDfile
Find this compound or compounds like it in BindingDB:
Activity Spreadsheet -- Enzyme Inhibition Constant Data from BindingDB
Found 2 hits for monomerid = 50311013
TargetTyrosine-protein kinase JAK3(Homo sapiens (Human))
Cytopia Research
Curated by ChEMBL
LigandPNGBDBM50311013(CHEMBL1078159 | N-(cyanomethyl)-3-(2-(4-morpholino...)
Affinity DataIC50: >5.00E+3nM. Assay description: Inhibition of GST-tagged JAK3 kinase
In DepthDetails ArticlePubMed
TargetTyrosine-protein kinase JAK2(Homo sapiens (Human))
Cytopia Research
Curated by ChEMBL
LigandPNGBDBM50311013(CHEMBL1078159 | N-(cyanomethyl)-3-(2-(4-morpholino...)
Affinity DataIC50:  545nM. Assay description: Inhibition of GST-tagged JAK2 kinase
In DepthDetails ArticlePubMed