BDBM50311040 CHEMBL1081493::N-(10-chloro-9H-benzo[f]imidazo[1,5-a][1,2,4]triazolo[1,5-d][1,4]diazepin-3-yl)acetamide
SMILES CC(=O)Nc1ccc-2c(c1)-c1ncnn1Cc1c(Cl)ncn-21
InChI Key InChIKey=WKYYFGMWPBWQAS-UHFFFAOYSA-N
Data  1 KI
  Tab Delimited (TSV)   2D SDfile   Computed 3D by Vconf -m prep SDfile
Find this compound or compounds like it in BindingDB:
Activity Spreadsheet -- Enzyme Inhibition Constant Data from BindingDB
Found 1 hit for monomerid = 50311040
TargetGABA-A receptor; alpha-5/beta-3/gamma-2(Homo sapiens (Human))
F. Hoffmann-La Roche
Curated by ChEMBL
LigandPNGBDBM50311040(CHEMBL1081493 | N-(10-chloro-9H-benzo[f]imidazo[1,...)
Affinity DataKi:  2.90nM. Assay description: Displacement of [3H]Flumazenil from cloned human GABAalpha5beta3gamma2 receptor expressed in HEK293 cells
In DepthDetails ArticlePubMed