BDBM50311126 (1S,4E,6E,8R,9R,10E,12E,14E,20S)-8-((2R,3S,4S,5R,6S)-3,4-dihydroxy-5-methoxy-6-methyltetrahydro-2H-pyran-2-yloxy)-18-((1R)-((2R,3R,4S,5R)-2,4-dihydroxy-6-((R)-2-((2R,4S,5S,6S)-4-hydroxy-5-((2S,4R,5R,6R)-5-hydroxy-4-methoxy-6-methyltetrahydro-2H-pyran-2-yloxy)-4,6-dimethyltetrahydro-2H-pyran-2-yloxy)-3-methoxypropyl)-3,5-dimethyltetrahydro-2H-pyran-2-yl)(hydroxy)methyl)-20-methoxy-5,9,11,13,15-pentamethyl-16-oxocycloicosa-4,6,10,12,14-pentaenyl acetate::CHEMBL1078488
SMILES COC[C@@H](CC1O[C@@](O)([C@H](O)C2C[C@H](OC)[C@H](CC\C=C(/C)\C=C\[C@@H](O[C@@H]3O[C@@H](C)[C@H](OC)[C@@H](O)[C@@H]3O)[C@H](C)\C=C(C)\C=C(C)C=C(C)C(=O)C2)OC(C)=O)[C@H](C)[C@@H](O)[C@H]1C)O[C@H]1C[C@](C)(O)[C@@H](O[C@H]2C[C@@H](OC)[C@H](O)[C@@H](C)O2)[C@H](C)O1
InChI Key InChIKey=OKSHTWZOWGVSGP-MCZNXUEXSA-N
Data  1 IC50
  Tab Delimited (TSV)   2D SDfile   Computed 3D by Vconf -m prep SDfile
Find this compound or compounds like it in BindingDB:
Activity Spreadsheet -- Enzyme Inhibition Constant Data from BindingDB
Found 1 hit for monomerid = 50311126
TargetATP synthase subunit beta, mitochondrial(Saccharomyces cerevisiae)
Yale University
Curated by ChEMBL
LigandPNGBDBM50311126((1S,4E,6E,8R,9R,10E,12E,14E,20S)-8-((2R,3S,4S,5R,6...)
Affinity DataIC50:  800nM. Assay description: Inhibition of yeast mitochondrial F0F1-ATPase
In DepthDetails ArticlePubMed