BDBM50311669 (13S,14S,15S)-3-Hydroxy-2-methoxy-13-methyl-7,11,12,13,15,20-hexahydro-6H,16H-cyclopropa[14,15]cyclopenta[a]phenanthren-17-one::CHEMBL1081172
SMILES COc1cc2C3=C(CCc2cc1O)[C@]12C[C@H]1CC(=O)[C@@]2(C)CC3
InChI Key InChIKey=IAPRFHNDECPPJX-BYYRLHKVSA-N
Data  1 IC50
  Tab Delimited (TSV)   2D SDfile   Computed 3D by Vconf -m prep SDfile
Find this compound or compounds like it in BindingDB:
Activity Spreadsheet -- Enzyme Inhibition Constant Data from BindingDB
Found 1 hit for monomerid = 50311669
Target17-beta-hydroxysteroid dehydrogenase type 1(Homo sapiens (Human))
Institute Of Experimental Genetics
Curated by ChEMBL
LigandPNGBDBM50311669((13S,14S,15S)-3-Hydroxy-2-methoxy-13-methyl-7,11,1...)
Affinity DataIC50:  193nM. Assay description: Inhibition of His-tagged human 17beta-HSD1 expressed in Escherichia coli by scintillation counting
In DepthDetails ArticlePubMed