BDBM50311685 (S)-1-(3-((2-hydroxypropanamido)methyl)phenyl)-N-(2-methoxybenzyl)-3-(trifluoromethyl)-1H-pyrazole-5-carboxamide::CHEMBL1080999
SMILES COc1ccccc1CNC(=O)c1cc(nn1-c1cccc(CNC(=O)[C@H](C)O)c1)C(F)(F)F
InChI Key InChIKey=YUYIFCALJLYZOT-AWEZNQCLSA-N
Data  1 IC50
  Tab Delimited (TSV)   2D SDfile   Computed 3D by Vconf -m prep SDfile
Find this compound or compounds like it in BindingDB:
Activity Spreadsheet -- Enzyme Inhibition Constant Data from BindingDB
Found 1 hit for monomerid = 50311685
TargetHistone-arginine methyltransferase CARM1(Mus musculus (mouse))
Methylgene
Curated by ChEMBL
LigandPNGBDBM50311685((S)-1-(3-((2-hydroxypropanamido)methyl)phenyl)-N-(...)
Affinity DataIC50: >2.00E+4nM. Assay description: Inhibition of N-terminal His-tagged mouse recombinant CARM1 expressed in Sf9 cells by microbeta counting
In DepthDetails ArticlePubMed