BDBM50311706 CHEMBL1087878::N-(2-(1H-indol-3-yl)ethyl)-1-(3-((2-(methylamino)ethylamino)methyl)phenyl)-3-(trifluoromethyl)-1H-pyrazole-5-carboxamide
SMILES CNCCNCc1cccc(c1)-n1nc(cc1C(=O)NCCc1c[nH]c2ccccc12)C(F)(F)F
InChI Key InChIKey=CTIJHIXSHKHOPF-UHFFFAOYSA-N
Data  1 IC50
  Tab Delimited (TSV)   2D SDfile   Computed 3D by Vconf -m prep SDfile
Find this compound or compounds like it in BindingDB:
Activity Spreadsheet -- Enzyme Inhibition Constant Data from BindingDB
Found 1 hit for monomerid = 50311706
TargetHistone-arginine methyltransferase CARM1(Mus musculus (mouse))
Methylgene
Curated by ChEMBL
LigandPNGBDBM50311706(CHEMBL1087878 | N-(2-(1H-indol-3-yl)ethyl)-1-(3-((...)
Affinity DataIC50:  1.80E+3nM. Assay description: Inhibition of N-terminal His-tagged mouse recombinant CARM1 expressed in Sf9 cells by microbeta counting
In DepthDetails ArticlePubMed