BDBM50311768 (R)-3-(1H-imidazol-4-yl)propyl pentan-2-ylcarbamate::CHEMBL1080263
SMILES CCC[C@@H](C)NC(=O)OCCCc1cnc[nH]1
InChI Key InChIKey=SBNMGPFYHROSKF-SNVBAGLBSA-N
Data  2 KI
  Tab Delimited (TSV)   2D SDfile   Computed 3D by Vconf -m prep SDfile
Find this compound or compounds like it in BindingDB:
Activity Spreadsheet -- Enzyme Inhibition Constant Data from BindingDB
Found 2 hits for monomerid = 50311768
TargetHistamine H3 receptor(Rattus norvegicus (rat))
Jagiellonian University Medical College
Curated by ChEMBL
LigandPNGBDBM50311768((R)-3-(1H-imidazol-4-yl)propyl pentan-2-ylcarbamat...)
Affinity DataKi:  12nM. Assay description: Displacement of [3H]histamine from histamine H3 receptor in rat cerebral cortex
In DepthDetails ArticlePubMed
TargetHistamine H3 receptor(Homo sapiens (Human))
Jagiellonian University Medical College
Curated by ChEMBL
LigandPNGBDBM50311768((R)-3-(1H-imidazol-4-yl)propyl pentan-2-ylcarbamat...)
Affinity DataKi:  15nM. Assay description: Displacement of [3H]iodoproxyfan from human histamine H3 receptor expressed in CHO-K1 cells
In DepthDetails ArticlePubMed