BDBM50311805 (1S,5S)-7-(4-(3-(2-chloro-3,6-difluorophenoxy)propyl)phenyl)-N-cyclopropyl-N-(3-methoxy-2-methylbenzyl)-3,9-diazabicyclo[3.3.1]non-6-ene-6-carboxamide::CHEMBL1076453
SMILES COc1cccc(CN(C2CC2)C(=O)C2=C(C[C@H]3CNC[C@H]2N3)c2ccc(CCCOc3c(F)ccc(F)c3Cl)cc2)c1C
InChI Key InChIKey=LBNVANDBNOMBKR-SETSBSEESA-N
Data  2 IC50
  Tab Delimited (TSV)   2D SDfile   Computed 3D by Vconf -m prep SDfile
Find this compound or compounds like it in BindingDB:
Activity Spreadsheet -- Enzyme Inhibition Constant Data from BindingDB
Found 2 hits for monomerid = 50311805
TargetRenin(Homo sapiens (Human))
Actelion Pharmaceuticals
Curated by ChEMBL
LigandPNGBDBM50311805((1S,5S)-7-(4-(3-(2-chloro-3,6-difluorophenoxy)prop...)
Affinity DataIC50:  54nM. Assay description: Inhibition of human rennin in human plasma assessed as accumulation of angiotensin 1 using human tetradecapeptide by immunoassay
In DepthDetails ArticlePubMed
TargetRenin(Homo sapiens (Human))
Actelion Pharmaceuticals
Curated by ChEMBL
LigandPNGBDBM50311805((1S,5S)-7-(4-(3-(2-chloro-3,6-difluorophenoxy)prop...)
Affinity DataIC50:  1.37nM. Assay description: Inhibition of human rennin in buffer assessed as accumulation of angiotensin 1 using human tetradecapeptide by immunoassay
In DepthDetails ArticlePubMed