BDBM50312167 1-(2,4-diethoxy-5-(trifluoromethyl)phenyl)-3-(3-(8-(pyridin-4-ylmethylamino)imidazo[1,2-a]pyrazin-6-yl)phenyl)urea::CHEMBL1075667
SMILES CCOc1cc(OCC)c(cc1NC(=O)Nc1cccc(c1)-c1cn2ccnc2c(NCc2ccncc2)n1)C(F)(F)F
InChI Key InChIKey=BDNDOZRIKYDPKJ-UHFFFAOYSA-N
Data  1 IC50
  Tab Delimited (TSV)   2D SDfile   Computed 3D by Vconf -m prep SDfile
Find this compound or compounds like it in BindingDB:
Activity Spreadsheet -- Enzyme Inhibition Constant Data from BindingDB
Found 1 hit for monomerid = 50312167
TargetEphrin type-B receptor 4(Homo sapiens (Human))
Cgi Pharmaceuticals
Curated by ChEMBL
LigandPNGBDBM50312167(1-(2,4-diethoxy-5-(trifluoromethyl)phenyl)-3-(3-(8...)
Affinity DataIC50:  211nM. Assay description: Inhibition of EphB4 autophosphorylation by cell based assay
In DepthDetails ArticlePubMed