BDBM50312479 2-(4-((4-(6-Morpholinopyridin-3-yl)-5-(4-(trifluoromethoxy)-phenyl)oxazol-2-yl)methoxy)-2-methylphenoxy)acetic Acid::CHEMBL1075894
SMILES Cc1cc(OCc2nc(c(o2)-c2ccc(OC(F)(F)F)cc2)-c2ccc(nc2)N2CCOCC2)ccc1OCC(O)=O
InChI Key InChIKey=YJQWSGKPHYWIRY-UHFFFAOYSA-N
Data  4 EC50
  Tab Delimited (TSV)   2D SDfile   Computed 3D by Vconf -m prep SDfile
Find this compound or compounds like it in BindingDB:
Activity Spreadsheet -- Enzyme Inhibition Constant Data from BindingDB
Found 4 hits for monomerid = 50312479
TargetPeroxisome proliferator-activated receptor delta(Homo sapiens (Human))
The Genomics Institute Of The Novartis Research Foundation
Curated by ChEMBL
LigandPNGBDBM50312479(2-(4-((4-(6-Morpholinopyridin-3-yl)-5-(4-(trifluor...)
Affinity DataEC50:  2nM. Assay description: Agonist activity at human PPARdelta ligand binding domain expressed in human 293T cells cotransfected with Gal4-DBD by luciferase transactivation ass...
In DepthDetails ArticlePubMed
TargetPeroxisome proliferator-activated receptor delta(Mus musculus)
The Genomics Institute Of The Novartis Research Foundation
Curated by ChEMBL
LigandPNGBDBM50312479(2-(4-((4-(6-Morpholinopyridin-3-yl)-5-(4-(trifluor...)
Affinity DataEC50:  5nM. Assay description: Agonist activity at mouse PPARdelta by FRET assay
In DepthDetails ArticlePubMed
TargetPeroxisome proliferator-activated receptor gamma(Homo sapiens (Human))
The Genomics Institute Of The Novartis Research Foundation
Curated by ChEMBL
LigandPNGBDBM50312479(2-(4-((4-(6-Morpholinopyridin-3-yl)-5-(4-(trifluor...)
Affinity DataEC50:  2.49E+3nM. Assay description: Agonist activity at human PPARgamma ligand binding domain expressed in human 293T cells cotransfected with Gal4-DBD by luciferase transactivation ass...
In DepthDetails ArticlePubMed
TargetPeroxisome proliferator-activated receptor alpha(Homo sapiens (Human))
The Genomics Institute Of The Novartis Research Foundation
Curated by ChEMBL
LigandPNGBDBM50312479(2-(4-((4-(6-Morpholinopyridin-3-yl)-5-(4-(trifluor...)
Affinity DataEC50:  1.20E+3nM. Assay description: Agonist activity at human PPARalpha ligand binding domain expressed in human 293T cells cotransfected with Gal4-DBD by luciferase transactivation ass...
In DepthDetails ArticlePubMed