BDBM50312480 2-(4-((4-(2-Isopropoxypyrimidin-5-yl)-5-(4-(trifluoromethoxy)-phenyl)oxazol-2-yl)methoxy)-2-methylphenoxy)acetic Acid::CHEMBL1080365
SMILES CC(C)Oc1ncc(cn1)-c1nc(COc2ccc(OCC(O)=O)c(C)c2)oc1-c1ccc(OC(F)(F)F)cc1
InChI Key InChIKey=HGCSAPWXXIVITD-UHFFFAOYSA-N
Data  3 EC50
  Tab Delimited (TSV)   2D SDfile   Computed 3D by Vconf -m prep SDfile
Find this compound or compounds like it in BindingDB:
Activity Spreadsheet -- Enzyme Inhibition Constant Data from BindingDB
Found 3 hits for monomerid = 50312480
TargetPeroxisome proliferator-activated receptor delta(Homo sapiens (Human))
The Genomics Institute Of The Novartis Research Foundation
Curated by ChEMBL
LigandPNGBDBM50312480(2-(4-((4-(2-Isopropoxypyrimidin-5-yl)-5-(4-(triflu...)
Affinity DataEC50:  1nM. Assay description: Agonist activity at human PPARdelta ligand binding domain expressed in human 293T cells cotransfected with Gal4-DBD by luciferase transactivation ass...
In DepthDetails ArticlePubMed
TargetPeroxisome proliferator-activated receptor gamma(Homo sapiens (Human))
The Genomics Institute Of The Novartis Research Foundation
Curated by ChEMBL
LigandPNGBDBM50312480(2-(4-((4-(2-Isopropoxypyrimidin-5-yl)-5-(4-(triflu...)
Affinity DataEC50:  980nM. Assay description: Agonist activity at human PPARgamma ligand binding domain expressed in human 293T cells cotransfected with Gal4-DBD by luciferase transactivation ass...
In DepthDetails ArticlePubMed
TargetPeroxisome proliferator-activated receptor alpha(Homo sapiens (Human))
The Genomics Institute Of The Novartis Research Foundation
Curated by ChEMBL
LigandPNGBDBM50312480(2-(4-((4-(2-Isopropoxypyrimidin-5-yl)-5-(4-(triflu...)
Affinity DataEC50:  160nM. Assay description: Agonist activity at human PPARalpha ligand binding domain expressed in human 293T cells cotransfected with Gal4-DBD by luciferase transactivation ass...
In DepthDetails ArticlePubMed