BDBM50312632 CHEMBL4164542
SMILES OC[C@H]1O[C@H]([C@H](O)[C@@H](O)[C@@H]1O)c1nc(n[nH]1)-c1cccc2ccccc12
InChI Key InChIKey=UGWCMNZLMGJTJS-IBEHDNSVSA-N
Data  3 KI
  Tab Delimited (TSV)   2D SDfile   Computed 3D by Vconf -m prep SDfile
Find this compound or compounds like it in BindingDB:
Activity Spreadsheet -- Enzyme Inhibition Constant Data from BindingDB
Found 3 hits for monomerid = 50312632
TargetGlycogen phosphorylase, muscle form(Oryctolagus cuniculus (rabbit))
University Of Debrecen
Curated by ChEMBL
LigandPNGBDBM50312632(CHEMBL4164542)
Affinity DataKi:  3.38E+3nM. Assay description: Inhibition of rabbit muscle glycogen phosphorylase-a assessed as release of inorganic phosphate using glucose-1-phosphate as substrate in presence of...
In DepthDetails ArticlePubMed
TargetGlycogen phosphorylase, liver form(Homo sapiens (Human))
University Of Debrecen
Curated by ChEMBL
LigandPNGBDBM50312632(CHEMBL4164542)
Affinity DataKi:  8.91E+3nM. Assay description: Inhibition of human liver glycogen phosphorylase-a assessed as release of inorganic phosphate using glucose-1-phosphate as substrate in presence of g...
In DepthDetails ArticlePubMed
TargetGlycogen phosphorylase, muscle form(Oryctolagus cuniculus (rabbit))
University Of Debrecen
Curated by ChEMBL
LigandPNGBDBM50312632(CHEMBL4164542)
Affinity DataKi:  1.15E+4nM. Assay description: Inhibition of rabbit muscle glycogen phosphorylase-b assessed as release of inorganic phosphate using glucose-1-phosphate as substrate in presence of...
In DepthDetails ArticlePubMed