BDBM50312967 CHEMBL1082003::N-(2-chloro-3,4'-bipyridin-6-yl)cyclopropanecarboxamide
SMILES Clc1nc(NC(=O)C2CC2)ccc1-c1ccncc1
InChI Key InChIKey=UWIFNOKIIITOJR-UHFFFAOYSA-N
Data  1 KI
  Tab Delimited (TSV)   2D SDfile   Computed 3D by Vconf -m prep SDfile
Find this compound or compounds like it in BindingDB:
Activity Spreadsheet -- Enzyme Inhibition Constant Data from BindingDB
Found 1 hit for monomerid = 50312967
TargetAdenosine receptor A2b(Homo sapiens (Human))
RhôNe-Poulenc Rorer
Curated by ChEMBL
LigandPNGBDBM50312967(CHEMBL1082003 | N-(2-chloro-3,4'-bipyridin-6-yl)cy...)
Affinity DataKi:  380nM. Assay description: Displacement of [3H]DPCPX from human adenosine A2B receptor expressed in HEK293 cells after 60 mins by filtration binding assay
In DepthDetails ArticlePubMed