BDBM50313173 (R)-2-((R)-1-ethyl-4-(4-ethylphenethyl)-3-methyl-6,7-dihydro-1H-pyrazolo[4,3-c]pyridin-5(4H)-yl)-N-methyl-2-phenylacetamide::CHEMBL1080882
SMILES CCc1ccc(CC[C@H]2N(CCc3c2c(C)nn3CC)[C@@H](C(=O)NC)c2ccccc2)cc1
InChI Key InChIKey=PPAKYKQRBNRNGC-SHQCIBLASA-N
Data  2 IC50
  Tab Delimited (TSV)   2D SDfile   Computed 3D by Vconf -m prep SDfile
Find this compound or compounds like it in BindingDB:
Activity Spreadsheet -- Enzyme Inhibition Constant Data from BindingDB
Found 2 hits for monomerid = 50313173
TargetOrexin receptor type 2(Homo sapiens (Human))
Actelion Pharmaceuticals
Curated by ChEMBL
LigandPNGBDBM50313173((R)-2-((R)-1-ethyl-4-(4-ethylphenethyl)-3-methyl-6...)
Affinity DataIC50:  174nM. Assay description: Antagonist activity at human OX2 receptor expressed in CHO cells assessed as inhibition of calcium mobilization by FLIPR assay
In DepthDetails ArticlePubMed
TargetOrexin/Hypocretin receptor type 1(Homo sapiens (Human))
Actelion Pharmaceuticals
Curated by ChEMBL
LigandPNGBDBM50313173((R)-2-((R)-1-ethyl-4-(4-ethylphenethyl)-3-methyl-6...)
Affinity DataIC50:  1.42E+3nM. Assay description: Antagonist activity at human OX1 receptor expressed in CHO cells assessed as inhibition of calcium mobilization by FLIPR assay
In DepthDetails ArticlePubMed