BDBM50313178 2-(1-ethyl-3-methyl-4-(3-(trifluoromethyl)phenethyl)-6,7-dihydro-1H-pyrazolo[4,3-c]pyridin-5(4H)-yl)-N-methyl-2-phenylacetamide::CHEMBL1080905
SMILES CCn1nc(C)c2C(CCc3cccc(c3)C(F)(F)F)N(CCc12)C(C(=O)NC)c1ccccc1
InChI Key InChIKey=UXNWFCOQEYDTIR-UHFFFAOYSA-N
Data  2 IC50
  Tab Delimited (TSV)   2D SDfile   Computed 3D by Vconf -m prep SDfile
Find this compound or compounds like it in BindingDB:
Activity Spreadsheet -- Enzyme Inhibition Constant Data from BindingDB
Found 2 hits for monomerid = 50313178
TargetOrexin receptor type 2(Homo sapiens (Human))
Actelion Pharmaceuticals
Curated by ChEMBL
LigandPNGBDBM50313178(2-(1-ethyl-3-methyl-4-(3-(trifluoromethyl)phenethy...)
Affinity DataIC50:  7nM. Assay description: Antagonist activity at human OX2 receptor expressed in CHO cells assessed as inhibition of calcium mobilization by FLIPR assay
In DepthDetails ArticlePubMed
TargetOrexin/Hypocretin receptor type 1(Homo sapiens (Human))
Actelion Pharmaceuticals
Curated by ChEMBL
LigandPNGBDBM50313178(2-(1-ethyl-3-methyl-4-(3-(trifluoromethyl)phenethy...)
Affinity DataIC50:  358nM. Assay description: Antagonist activity at human OX1 receptor expressed in CHO cells assessed as inhibition of calcium mobilization by FLIPR assay
In DepthDetails ArticlePubMed