BDBM50313180 2-(4-(4-chlorophenethyl)-1-ethyl-3-methyl-6,7-dihydro-1H-pyrazolo[4,3-c]pyridin-5(4H)-yl)-N-methyl-2-phenylacetamide::CHEMBL1081253
SMILES CCn1nc(C)c2C(CCc3ccc(Cl)cc3)N(CCc12)C(C(=O)NC)c1ccccc1
InChI Key InChIKey=ULALCBUGNVGAOF-UHFFFAOYSA-N
Data  2 IC50
  Tab Delimited (TSV)   2D SDfile   Computed 3D by Vconf -m prep SDfile
Find this compound or compounds like it in BindingDB:
Activity Spreadsheet -- Enzyme Inhibition Constant Data from BindingDB
Found 2 hits for monomerid = 50313180
TargetOrexin receptor type 2(Homo sapiens (Human))
Actelion Pharmaceuticals
Curated by ChEMBL
LigandPNGBDBM50313180(2-(4-(4-chlorophenethyl)-1-ethyl-3-methyl-6,7-dihy...)
Affinity DataIC50:  12nM. Assay description: Antagonist activity at human OX2 receptor expressed in CHO cells assessed as inhibition of calcium mobilization by FLIPR assay
In DepthDetails ArticlePubMed
TargetOrexin/Hypocretin receptor type 1(Homo sapiens (Human))
Actelion Pharmaceuticals
Curated by ChEMBL
LigandPNGBDBM50313180(2-(4-(4-chlorophenethyl)-1-ethyl-3-methyl-6,7-dihy...)
Affinity DataIC50:  993nM. Assay description: Antagonist activity at human OX1 receptor expressed in CHO cells assessed as inhibition of calcium mobilization by FLIPR assay
In DepthDetails ArticlePubMed